kernel compilation I got stuck in a step for make

by sheprogrm   Last Updated September 14, 2018 16:02 PM

The following error shows after sudo make command runs... All previous steps for compilation like make menuconfig and ncurses pkg installation successfully completed.


HOSTLD  arch/x86/tools/relocs
arch/x86/tools/relocs_32.o: In function `write32':
relocs_32.c:(.text+0x3dc): undefined reference to `put_unaligned_le32'
arch/x86/tools/relocs_64.o: In function `write32':
relocs_64.c:(.text+0x12c): undefined reference to `put_unaligned_le32'
collect2: error: ld returned 1 exit status
make[1]: *** [arch/x86/tools/relocs] Error 1
make: *** [archscripts] Error 2
Tags : kernel compiling

Related Questions

cputype.h missing

Updated March 09, 2017 12:02 PM

error compiling with bitops.h

Updated April 12, 2017 20:02 PM

why linux-source-4.4.0 compiled to 4.4.79

Updated September 18, 2017 09:02 AM